Log file for a failed "gmake all"

This log file was generated by following the instructions in Example 2, but with the line:
#include "BetaMiniUser/QExample.hh"
"accidentally" removed from BetaMiniUser/QExample.cc.
GNU Make version 3.79.1,Build OPTIONS = Linux24SL3_i386_gcc323-Debug-native-Objy-Optimize-Fastbuild-Ldlink2-SkipSlaclog-Static-LstaticLinux bldlnx07 2.4.21-47.ELsmp #1 SMP Thu Jul 20 09:54:04 CDT 2006 i686 i686 i386 GNU/Linux  [uname -a]-> all:Saving Spec of this build to .spec.Linux24SL3_i386_gcc323.3Start saving index of binaries into bin/Linux24SL3_i386_gcc323/Index-> installdirs:-> database.import:   (Sat Apr 21 21:11:57 PDT 2007)import (Objy V8.0):   Import Directory /afs/slac.stanford.edu/g/babar/dist/releases/22.1.1/database/export  Import Name      BaBarRef  Boot file        /nfs/objyserv07/objy/databases/user2/penguin/6750/BaBar.BOOT  FDB              /nfs/objyserv07/objy/databases/user2/penguin/6750/BaBar.FDB  Journal Dir      /nfs/objyserv07/objy/databases/user2/penguin/6750  AMS Server       objyserv07.slac.stanford.edu  Lock Server      objylock05.slac.stanford.edu  Journal Server   objyserv07.slac.stanford.edu  FDB ID           6750import: /nfs/objyserv07/objy/databases/user2/penguin/6750/BaBar.BOOT already exists-> schema:-> include:-> BetaMiniUser.include:   (Sat Apr 21 21:11:58 PDT 2007)Making QExample.d [cc1]Making NamedScalers.d [cc1]Making MyTimePointAnalysis.d [cc1]Making MyReadList.d [cc1]Making MyMiniAnalysis.d [cc1]Making MyK0Analysis.d [cc1]Making MyHistManager.d [cc1]Making MyDstarAnalysis.d [cc1]Making BetaMiniBackgroundFrameCounter.d [cc1]Making AppUserBuildBase.d [cc3]Making AppUserBuildRoo.d [cc3]Making AppUserBuild.d [cc3]-> database.include:   (Sat Apr 21 21:12:48 PDT 2007)-> workdir.include:   (Sat Apr 21 21:12:49 PDT 2007)Updating debugger directory file .dbxinitUpdating debugger directory file .gdbinit-> lib-> BetaMiniUser.lib:   (Sat Apr 21 21:12:50 PDT 2007)Compiling BetaMiniBackgroundFrameCounter.cc [libBetaMiniUser.a] [cc-1]Compiling MyDstarAnalysis.cc [libBetaMiniUser.a] [cc-1]Compiling MyHistManager.cc [libBetaMiniUser.a] [cc-1]Compiling MyK0Analysis.cc [libBetaMiniUser.a] [cc-1]Compiling MyMiniAnalysis.cc [libBetaMiniUser.a] [cc-1]Compiling MyReadList.cc [libBetaMiniUser.a] [cc-1]Compiling MyTimePointAnalysis.cc [libBetaMiniUser.a] [cc-1]Compiling NamedScalers.cc [libBetaMiniUser.a] [cc-1]Compiling QExample.cc [libBetaMiniUser.a] [cc-1]/afs/slac.stanford.edu/u/br/penguin/ana41/BetaMiniUser/QExample.cc:25: syntax    error before `::' token/afs/slac.stanford.edu/u/br/penguin/ana41/BetaMiniUser/QExample.cc:37: syntax    error before `::' token/afs/slac.stanford.edu/u/br/penguin/ana41/BetaMiniUser/QExample.cc:51: syntax    error before `::' token/afs/slac.stanford.edu/u/br/penguin/ana41/BetaMiniUser/QExample.cc:57: warning: ISO   C++ forbids declaration of `_numTrkHisto' with no type/afs/slac.stanford.edu/u/br/penguin/ana41/BetaMiniUser/QExample.cc:57: `manager   ' was not declared in this scope/afs/slac.stanford.edu/u/br/penguin/ana41/BetaMiniUser/QExample.cc:58: warning: ISO   C++ forbids declaration of `_pHisto' with no type/afs/slac.stanford.edu/u/br/penguin/ana41/BetaMiniUser/QExample.cc:58: `manager   ' was not declared in this scope/afs/slac.stanford.edu/u/br/penguin/ana41/BetaMiniUser/QExample.cc:60: syntax    error before `return'/afs/slac.stanford.edu/u/br/penguin/ana41/BetaMiniUser/QExample.cc:66: syntax    error before `::' token/afs/slac.stanford.edu/u/br/penguin/ana41/BetaMiniUser/QExample.cc:75: syntax    error before `::' token/afs/slac.stanford.edu/u/br/penguin/ana41/BetaMiniUser/QExample.cc:83: syntax    error before `->' token/afs/slac.stanford.edu/u/br/penguin/ana41/BetaMiniUser/QExample.cc:86: `trkList   ' was not declared in this scope/afs/slac.stanford.edu/u/br/penguin/ana41/BetaMiniUser/QExample.cc:88: syntax    error before `while'gmake[3]: *** [/afs/slac.stanford.edu/u/br/penguin/ana41/lib/Linux24SL3_i386_gcc323/libBetaMiniUser.a(QExample.o)] Error 1gmake[2]: *** [BetaMiniUser.lib] Error 2-> database.lib:   (Sat Apr 21 21:13:51 PDT 2007)lib stage done in /afs/slac.stanford.edu/u/br/penguin/ana41/database-> workdir.lib:   (Sat Apr 21 21:13:52 PDT 2007)-> bin-> BetaMiniUser.bin:   (Sat Apr 21 21:13:52 PDT 2007)Compiling AppUserBuild.cc [AppUserBuild.o] [cc-3]Compiling AppUserBuildRoo.cc [AppUserBuildRoo.o] [cc-3]Compiling AppUserBuildBase.cc [AppUserBuildBase.o] [cc-3]Compiling BetaMiniBackgroundFrameCounter.cc [libBetaMiniUser.a] [cc-1]Compiling MyDstarAnalysis.cc [libBetaMiniUser.a] [cc-1]Compiling MyHistManager.cc [libBetaMiniUser.a] [cc-1]Compiling MyK0Analysis.cc [libBetaMiniUser.a] [cc-1]Compiling MyMiniAnalysis.cc [libBetaMiniUser.a] [cc-1]Compiling MyReadList.cc [libBetaMiniUser.a] [cc-1]Compiling MyTimePointAnalysis.cc [libBetaMiniUser.a] [cc-1]Compiling NamedScalers.cc [libBetaMiniUser.a] [cc-1]Compiling QExample.cc [libBetaMiniUser.a] [cc-1]/afs/slac.stanford.edu/u/br/penguin/ana41/BetaMiniUser/QExample.cc:25: syntax    error before `::' token/afs/slac.stanford.edu/u/br/penguin/ana41/BetaMiniUser/QExample.cc:37: syntax    error before `::' token/afs/slac.stanford.edu/u/br/penguin/ana41/BetaMiniUser/QExample.cc:51: syntax    error before `::' token/afs/slac.stanford.edu/u/br/penguin/ana41/BetaMiniUser/QExample.cc:57: warning: ISO   C++ forbids declaration of `_numTrkHisto' with no type/afs/slac.stanford.edu/u/br/penguin/ana41/BetaMiniUser/QExample.cc:57: `manager   ' was not declared in this scope/afs/slac.stanford.edu/u/br/penguin/ana41/BetaMiniUser/QExample.cc:58: warning: ISO   C++ forbids declaration of `_pHisto' with no type/afs/slac.stanford.edu/u/br/penguin/ana41/BetaMiniUser/QExample.cc:58: `manager   ' was not declared in this scope/afs/slac.stanford.edu/u/br/penguin/ana41/BetaMiniUser/QExample.cc:60: syntax    error before `return'/afs/slac.stanford.edu/u/br/penguin/ana41/BetaMiniUser/QExample.cc:66: syntax    error before `::' token/afs/slac.stanford.edu/u/br/penguin/ana41/BetaMiniUser/QExample.cc:75: syntax    error before `::' token/afs/slac.stanford.edu/u/br/penguin/ana41/BetaMiniUser/QExample.cc:83: syntax    error before `->' token/afs/slac.stanford.edu/u/br/penguin/ana41/BetaMiniUser/QExample.cc:86: `trkList   ' was not declared in this scope/afs/slac.stanford.edu/u/br/penguin/ana41/BetaMiniUser/QExample.cc:88: syntax    error before `while'gmake[4]: *** [/afs/slac.stanford.edu/u/br/penguin/ana41/lib/Linux24SL3_i386_gcc323/libBetaMiniUser.a(QExample.o)] Error 1bin stage done in /afs/slac.stanford.edu/u/br/penguin/ana41/BetaMiniUser-> database.bin:   (Sat Apr 21 21:18:23 PDT 2007)bin stage done in /afs/slac.stanford.edu/u/br/penguin/ana41/database-> workdir.bin:   (Sat Apr 21 21:18:25 PDT 2007)-> javalinks:javalinks stage done------------------------------------------------------------Sender: LSF System Subject: Job 643872:  DoneJob  was submitted from host  by user .Job was executed on host(s) , in queue <bldrecoq>, as user . was used as the home directory. was used as the working directory.Started at Sat Apr 21 21:11:42 2007Results reported at Sat Apr 21 21:18:26 2007Your job looked like:------------------------------------------------------------# LSBATCH: User inputgmake all------------------------------------------------------------Successfully completed.Resource usage summary:    CPU time   :    180.08 sec.    Max Memory :        42 MB    Max Swap   :        77 MB    Max Processes  :        13    Max Threads    :        13The output (if any) is above this job summary.